(view as text)
make all V=s
 in dir /home/buildbot/slaves/firmware-1/ar71xx_generic/build/trunk (timeout 1200 secs)
 watching logfiles {}
 argv: ['make', 'all', 'V=s']
 environment:
  HOME=/home/buildbot
  LANG=C
  LOGNAME=buildbot
  MAIL=/var/mail/buildbot
  PATH=/usr/local/bin:/usr/bin:/bin:/usr/local/games:/usr/games
  PWD=/home/buildbot/slaves/firmware-1/ar71xx_generic/build/trunk
  SHELL=/bin/sh
  USER=buildbot
  XDG_RUNTIME_DIR=/run/user/111
  XDG_SESSION_ID=c1
 using PTY: False
cd /home/buildbot/slaves/firmware-1/ar71xx_generic/build/trunk/build/trunk/openwrt/mips/ar71xx/generic/trunk-HEAD; quilt push -a
Applying patch patches/021_7_install_kernel_modules_and_merge_debwrt_config
patching file include/kernel-defaults.mk
Hunk #1 FAILED at 198.
1 out of 1 hunk FAILED -- rejects in file include/kernel-defaults.mk
Patch patches/021_7_install_kernel_modules_and_merge_debwrt_config does not apply (enforce with -f)
openwrt/openwrt.mk:144: recipe for target 'openwrt/patch' failed
make: *** [openwrt/patch] Error 1
program finished with exit code 2
elapsedTime=0.656837