(view as text)
make all V=s
 in dir /home/buildbot/slaves/firmware-1/ar71xx_generic/build/trunk (timeout 1200 secs)
 watching logfiles {}
 argv: ['make', 'all', 'V=s']
 environment:
  HOME=/home/buildbot
  LANG=C
  LOGNAME=buildbot
  MAIL=/var/mail/buildbot
  PATH=/usr/local/bin:/usr/bin:/bin:/usr/local/games:/usr/games
  PWD=/home/buildbot/slaves/firmware-1/ar71xx_generic/build/trunk
  SHELL=/bin/sh
  USER=buildbot
  XDG_RUNTIME_DIR=/run/user/111
  XDG_SESSION_ID=c1
 using PTY: False
OpenWrt make parallelization: 1
/home/buildbot/slaves/firmware-1/ar71xx_generic/build/trunk/rules/clean_exec.sh make -j1 -C /home/buildbot/slaves/firmware-1/ar71xx_generic/build/trunk/build/trunk/openwrt/mips/ar71xx/generic/trunk-HEAD "" V=s
make: Entering directory '/home/buildbot/slaves/firmware-1/ar71xx_generic/build/trunk/build/trunk/openwrt/mips/ar71xx/generic/trunk-HEAD'
make[1]: Entering directory '/home/buildbot/slaves/firmware-1/ar71xx_generic/build/trunk/build/trunk/openwrt/mips/ar71xx/generic/trunk-HEAD'
make[2]: Entering directory '/home/buildbot/slaves/firmware-1/ar71xx_generic/build/trunk/build/trunk/openwrt/mips/ar71xx/generic/trunk-HEAD'
make[2]: Leaving directory '/home/buildbot/slaves/firmware-1/ar71xx_generic/build/trunk/build/trunk/openwrt/mips/ar71xx/generic/trunk-HEAD'
make[2]: Entering directory '/home/buildbot/slaves/firmware-1/ar71xx_generic/build/trunk/build/trunk/openwrt/mips/ar71xx/generic/trunk-HEAD'
/home/buildbot/slaves/firmware-1/ar71xx_generic/build/trunk/build/trunk/openwrt/mips/ar71xx/generic/trunk-HEAD/include/image.mk:217: *** missing 'endef', unterminated 'define'.  Stop.
Makefile:24: recipe for target 'image-prereq' failed
make[5]: *** [image-prereq] Error 2
Makefile:13: recipe for target 'prereq' failed
make[4]: *** [prereq] Error 2
target/Makefile:22: recipe for target 'target/linux/prereq' failed
make[3]: *** [target/linux/prereq] Error 2
target/Makefile:16: recipe for target '/home/buildbot/slaves/firmware-1/ar71xx_generic/build/trunk/build/trunk/openwrt/mips/ar71xx/generic/trunk-HEAD/staging_dir/target-mips_24kc_musl-1.1.16/stamp/.target_prereq' failed
make[2]: *** [/home/buildbot/slaves/firmware-1/ar71xx_generic/build/trunk/build/trunk/openwrt/mips/ar71xx/generic/trunk-HEAD/staging_dir/target-mips_24kc_musl-1.1.16/stamp/.target_prereq] Error 2
make[2]: Leaving directory '/home/buildbot/slaves/firmware-1/ar71xx_generic/build/trunk/build/trunk/openwrt/mips/ar71xx/generic/trunk-HEAD'
/home/buildbot/slaves/firmware-1/ar71xx_generic/build/trunk/build/trunk/openwrt/mips/ar71xx/generic/trunk-HEAD/include/toplevel.mk:185: recipe for target 'prereq' failed
make[1]: Leaving directory '/home/buildbot/slaves/firmware-1/ar71xx_generic/build/trunk/build/trunk/openwrt/mips/ar71xx/generic/trunk-HEAD'
make[1]: *** [prereq] Error 2
/home/buildbot/slaves/firmware-1/ar71xx_generic/build/trunk/build/trunk/openwrt/mips/ar71xx/generic/trunk-HEAD/include/toplevel.mk:202: recipe for target 'world' failed
make: Leaving directory '/home/buildbot/slaves/firmware-1/ar71xx_generic/build/trunk/build/trunk/openwrt/mips/ar71xx/generic/trunk-HEAD'
make: *** [world] Error 2
openwrt/openwrt.mk:77: recipe for target 'openwrt/build' failed
make: *** [openwrt/build] Error 2
program finished with exit code 2
elapsedTime=3.514068